Reaction Details
TargetKallikrein-5 [D153N]
LigandBDBM50391077
Substrate/Competitorn/a
Meas. Tech.ChEMBL_840619 (CHEMBL2090270)
IC50 323500±n/a nM
Citation Freitas, RFTeixeira, TSBarros, TGSantos, JAKondo, MYJuliano, MAJuliano, LBlaber, MAntunes, OAAbrahão, OPinheiro, SMuri, EMPuzer, L Isomannide derivatives as new class of inhibitors for human kallikrein 7. Bioorg Med Chem Lett22:6072-5 (2012) 
 
Kallikrein-5 [D153N]
Name:Kallikrein-5 [D153N]
Type:PROTEIN
Mol. Mass.:32031.75
Organism:Homo sapiens (Human)
Description:ChEMBL_1282456
Residue:293
BDBM50391077
NameBDBM50391077
Synonyms:CHEMBL2087345
TypeSmall organic molecule
Emp. Form.C28H27N3O5
Mol. Mass.485.5311
SMILESO=C(N[C@@H]1CO[C@@H]2[C@@H](CO[C@H]12)OCc1ccccc1)C(\NC(=O)c1ccccc1)=C\c1cccnc1