Reaction Details
TargetKallikrein-7
LigandBDBM50391075
Substrate/Competitorn/a
Meas. Tech.ChEMBL_840622 (CHEMBL2090273)
Ki 1800±n/a nM
Citation Freitas, RFTeixeira, TSBarros, TGSantos, JAKondo, MYJuliano, MAJuliano, LBlaber, MAntunes, OAAbrahão, OPinheiro, SMuri, EMPuzer, L Isomannide derivatives as new class of inhibitors for human kallikrein 7. Bioorg Med Chem Lett22:6072-5 (2012) 
 
Kallikrein-7
Name:Kallikrein-7
Type:PROTEIN
Mol. Mass.:27535.05
Organism:Homo sapiens (Human)
Description:ChEMBL_1469257
Residue:253
BDBM50391075
NameBDBM50391075
Synonyms:CHEMBL2087343
TypeSmall organic molecule
Emp. Form.C27H26N2O5S
Mol. Mass.490.571
SMILESO=C(N[C@@H]1CO[C@@H]2[C@@H](CO[C@H]12)OCc1ccccc1)C(\NC(=O)c1ccccc1)=C\c1cccs1