Reaction Details
TargetPhosphatidylinositol 4,5-bisphosphate 3-kinase catalytic subunit alpha isoform
LigandBDBM50391200
Substrate/Competitorn/a
Meas. Tech.ChEMBL_840815 (CHEMBL2090598)
IC50 4100±n/a nM
Citation Bruel, ALogé, CTauzia, MLRavache, MLe Guevel, RGuillouzo, CLohier, JFOliveira Santos, JSLozach, OMeijer, LRuchaud, SBénédetti, HRobert, JM Synthesis and biological evaluation of new 5-benzylated 4-oxo-3,4-dihydro-5H-pyridazino[4,5-b]indoles as PI3Ka inhibitors. Eur J Med Chem57:225-33 (2012) 
 
Phosphatidylinositol 4,5-bisphosphate 3-kinase catalytic subunit alpha isoform
Name:Phosphatidylinositol 4,5-bisphosphate 3-kinase catalytic subunit alpha isoform
Type:Enzyme Subunit
Mol. Mass.:124294.87
Organism:Homo sapiens (Human)
Description:P42336
Residue:1068
BDBM50391200
NameBDBM50391200
Synonyms:CHEMBL2088661
TypeSmall organic molecule
Emp. Form.C18H13BrN4O3
Mol. Mass.413.225
SMILESCc1n[nH]c(=O)c2n(Cc3cccc(c3)[N+]([O-])=O)c3ccc(Br)cc3c12