Reaction Details
TargetPhosphatidylinositol 4,5-bisphosphate 3-kinase catalytic subunit alpha isoform
LigandBDBM50391185
Substrate/Competitorn/a
Meas. Tech.ChEMBL_840815 (CHEMBL2090598)
IC50 295±n/a nM
Citation Bruel, ALogé, CTauzia, MLRavache, MLe Guevel, RGuillouzo, CLohier, JFOliveira Santos, JSLozach, OMeijer, LRuchaud, SBénédetti, HRobert, JM Synthesis and biological evaluation of new 5-benzylated 4-oxo-3,4-dihydro-5H-pyridazino[4,5-b]indoles as PI3Ka inhibitors. Eur J Med Chem57:225-33 (2012) 
 
Phosphatidylinositol 4,5-bisphosphate 3-kinase catalytic subunit alpha isoform
Name:Phosphatidylinositol 4,5-bisphosphate 3-kinase catalytic subunit alpha isoform
Type:Enzyme Subunit
Mol. Mass.:124294.87
Organism:Homo sapiens (Human)
Description:P42336
Residue:1068
BDBM50391185
NameBDBM50391185
Synonyms:CHEMBL2088663
TypeSmall organic molecule
Emp. Form.C19H13BrN4O
Mol. Mass.393.237
SMILESCc1n[nH]c(=O)c2n(Cc3cccc(c3)C#N)c3ccc(Br)cc3c12