Reaction Details
TargetIndoleamine 2,3-dioxygenase 1
LigandBDBM50391363
Substrate/Competitorn/a
Meas. Tech.ChEMBL_847931 (CHEMBL2150231)
IC50 80±n/a nM
Citation Röhrig, UFMajjigapu, SRGrosdidier, ABron, SStroobant, VPilotte, LColau, DVogel, PVan den Eynde, BJZoete, VMichielin, O Rational design of 4-aryl-1,2,3-triazoles for indoleamine 2,3-dioxygenase 1 inhibition. J Med Chem55:5270-90 (2012) 
 
Indoleamine 2,3-dioxygenase 1
Name:Indoleamine 2,3-dioxygenase 1
Type:Enzyme
Mol. Mass.:45330.80
Organism:Homo sapiens (Human)
Description:P14902
Residue:403
BDBM50391363
NameBDBM50391363
Synonyms:CHEMBL2148074
TypeSmall organic molecule
Emp. Form.C8H6ClN3O
Mol. Mass.195.606
SMILESOc1ccc(Cl)cc1-c1c[nH]nn1