Reaction Details
TargetIndoleamine 2,3-dioxygenase 1
LigandBDBM50391365
Substrate/Competitorn/a
Meas. Tech.ChEMBL_847930 (CHEMBL2150230)
IC50 29±n/a nM
Citation Röhrig, UFMajjigapu, SRGrosdidier, ABron, SStroobant, VPilotte, LColau, DVogel, PVan den Eynde, BJZoete, VMichielin, O Rational design of 4-aryl-1,2,3-triazoles for indoleamine 2,3-dioxygenase 1 inhibition. J Med Chem55:5270-90 (2012) 
 
Indoleamine 2,3-dioxygenase 1
Name:Indoleamine 2,3-dioxygenase 1
Type:PROTEIN
Mol. Mass.:45639.39
Organism:Mus musculus
Description:ChEMBL_1452149
Residue:407
BDBM50391365
NameBDBM50391365
Synonyms:CHEMBL2147990
TypeSmall organic molecule
Emp. Form.C9H6N4
Mol. Mass.170.1707
SMILESN#Cc1cccc(c1)-c1c[nH]nn1