Reaction Details
TargetTryptophan 2,3-dioxygenase
LigandBDBM50391367
Substrate/Competitorn/a
Meas. Tech.ChEMBL_847933 (CHEMBL2150233)
IC50>100000±n/a nM
Citation Röhrig, UFMajjigapu, SRGrosdidier, ABron, SStroobant, VPilotte, LColau, DVogel, PVan den Eynde, BJZoete, VMichielin, O Rational design of 4-aryl-1,2,3-triazoles for indoleamine 2,3-dioxygenase 1 inhibition. J Med Chem55:5270-90 (2012) 
 
Tryptophan 2,3-dioxygenase
Name:Tryptophan 2,3-dioxygenase
Type:PROTEIN
Mol. Mass.:47874.48
Organism:Homo sapiens (Human)
Description:ChEMBL_825691
Residue:406
BDBM50391367
NameBDBM50391367
Synonyms:CHEMBL2147994
TypeSmall organic molecule
Emp. Form.C8H6FN3
Mol. Mass.163.1517
SMILESFc1cccc(c1)-c1c[nH]nn1