Reaction Details
TargetIndoleamine 2,3-dioxygenase 1
LigandBDBM50391362
Substrate/Competitorn/a
Meas. Tech.ChEMBL_847925 (CHEMBL2150124)
pH6.5±n/a
IC50 80000±n/a nM
Commentsextracted
Citation Röhrig, UFMajjigapu, SRGrosdidier, ABron, SStroobant, VPilotte, LColau, DVogel, PVan den Eynde, BJZoete, VMichielin, O Rational design of 4-aryl-1,2,3-triazoles for indoleamine 2,3-dioxygenase 1 inhibition. J Med Chem55:5270-90 (2012) 
 
Indoleamine 2,3-dioxygenase 1
Name:Indoleamine 2,3-dioxygenase 1
Type:Enzyme
Mol. Mass.:45330.80
Organism:Homo sapiens (Human)
Description:P14902
Residue:403
BDBM50391362
NameBDBM50391362
Synonyms:CHEMBL2148000
TypeSmall organic molecule
Emp. Form.C8H6FN3
Mol. Mass.163.1517
SMILESFc1ccccc1-c1c[nH]nn1