Reaction Details
TargetCarbonic anhydrase 12
LigandBDBM50387129
Substrate/Competitorn/a
Meas. Tech.ChEMBL_847943 (CHEMBL2150243)
Ki 2±n/a nM
Citation Gieling, RGBabur, MMamnani, LBurrows, NTelfer, BACarta, FWinum, JYScozzafava, ASupuran, CTWilliams, KJ Antimetastatic effect of sulfamate carbonic anhydrase IX inhibitors in breast carcinoma xenografts. J Med Chem55:5591-600 (2012) 
 
Carbonic anhydrase 12
Name:Carbonic anhydrase 12
Type:Enzyme
Mol. Mass.:39456.00
Organism:Homo sapiens (Human)
Description:Catalytic domain of human cloned isozyme was used in the assay
Residue:354
BDBM50387129
NameBDBM50387129
Synonyms:4-ureidophenyl sulfamate ring derivative 3n | CHEMBL2047809
TypeSmall organic molecule
Emp. Form.C15H18N4O4S
Mol. Mass.350.393
SMILESCN(C)c1ccc(NC(=O)Nc2ccc(OS(N)(=O)=O)cc2)cc1