Reaction Details
TargetCarbonic anhydrase 1
LigandBDBM50391384
Substrate/Competitorn/a
Meas. Tech.ChEMBL_847940 (CHEMBL2150240)
Ki 6125±n/a nM
Citation Gieling, RGBabur, MMamnani, LBurrows, NTelfer, BACarta, FWinum, JYScozzafava, ASupuran, CTWilliams, KJ Antimetastatic effect of sulfamate carbonic anhydrase IX inhibitors in breast carcinoma xenografts. J Med Chem55:5591-600 (2012) 
 
Carbonic anhydrase 1
Name:Carbonic anhydrase 1
Type:Enzyme
Mol. Mass.:28873.37
Organism:Homo sapiens (Human)
Description:P00915
Residue:261
BDBM50391384
NameBDBM50391384
Synonyms:CHEMBL2148104
TypeSmall organic molecule
Emp. Form.C27H19N3O8S2
Mol. Mass.577.585
SMILESNS(=O)(=O)Oc1ccc(NC(=S)Nc2ccc(c(c2)C(O)=O)-c2c3ccc(O)cc3oc3cc(=O)ccc23)cc1