Reaction Details
TargetCarbonic anhydrase 9
LigandBDBM50387125
Substrate/Competitorn/a
Meas. Tech.ChEMBL_847942 (CHEMBL2150242)
Ki 6±n/a nM
Citation Gieling, RGBabur, MMamnani, LBurrows, NTelfer, BACarta, FWinum, JYScozzafava, ASupuran, CTWilliams, KJ Antimetastatic effect of sulfamate carbonic anhydrase IX inhibitors in breast carcinoma xenografts. J Med Chem55:5591-600 (2012) 
 
Carbonic anhydrase 9
Name:Carbonic anhydrase 9
Type:Enzyme
Mol. Mass.:49669.03
Organism:Homo sapiens (Human)
Description:Catalytic domain of human cloned isozyme was used in the assay
Residue:459
BDBM50387125
NameBDBM50387125
Synonyms:4-ureidophenyl sulfamate ring derivative 3j | CHEMBL2047805
TypeSmall organic molecule
Emp. Form.C13H8F5N3O4S
Mol. Mass.397.277
SMILESNS(=O)(=O)Oc1ccc(NC(=O)Nc2c(F)c(F)c(F)c(F)c2F)cc1