Reaction Details
TargetCarbonic anhydrase 2
LigandBDBM50391385
Substrate/Competitorn/a
Meas. Tech.ChEMBL_847941 (CHEMBL2150241)
Ki 760±n/a nM
Citation Gieling, RGBabur, MMamnani, LBurrows, NTelfer, BACarta, FWinum, JYScozzafava, ASupuran, CTWilliams, KJ Antimetastatic effect of sulfamate carbonic anhydrase IX inhibitors in breast carcinoma xenografts. J Med Chem55:5591-600 (2012) 
 
Carbonic anhydrase 2
Name:Carbonic anhydrase 2
Type:Enzyme
Mol. Mass.:29250.71
Organism:Homo sapiens (Human)
Description:P00918
Residue:260
BDBM50391385
NameBDBM50391385
Synonyms:CHEMBL2148105
TypeSmall organic molecule
Emp. Form.C29H23N2O3S
Mol. Mass.479.569
SMILESNS(=O)(=O)Oc1ccc(cc1)-[n+]1c(cc(cc1-c1ccccc1)-c1ccccc1)-c1ccccc1