Reaction Details
TargetCarbonic anhydrase 9
LigandBDBM50387127
Substrate/Competitorn/a
Meas. Tech.ChEMBL_847942 (CHEMBL2150242)
Ki 18±n/a nM
Citation Gieling, RGBabur, MMamnani, LBurrows, NTelfer, BACarta, FWinum, JYScozzafava, ASupuran, CTWilliams, KJ Antimetastatic effect of sulfamate carbonic anhydrase IX inhibitors in breast carcinoma xenografts. J Med Chem55:5591-600 (2012) 
 
Carbonic anhydrase 9
Name:Carbonic anhydrase 9
Type:Enzyme
Mol. Mass.:49669.03
Organism:Homo sapiens (Human)
Description:Catalytic domain of human cloned isozyme was used in the assay
Residue:459
BDBM50387127
NameBDBM50387127
Synonyms:4-ureidophenyl sulfamate ring derivative 3l | CHEMBL2047807
TypeSmall organic molecule
Emp. Form.C15H17N3O4S
Mol. Mass.335.378
SMILESNS(=O)(=O)Oc1ccc(NC(=O)NCCc2ccccc2)cc1