Reaction Details
TargetSodium channel protein type 9 subunit alpha
LigandBDBM50391495
Substrate/Competitorn/a
Meas. Tech.ChEMBL_849456 (CHEMBL2149457)
IC50 3162±n/a nM
Citation Kers, IMacsari, ICsjernyik, GNylöf, MSkogholm, KSandberg, LMinidis, ABueters, TMalmborg, JEriksson, ABLund, PEVenyike, ELuo, LNyström, JEBesidski, Y Phenethyl nicotinamides, a novel class of Na(V)1.7 channel blockers: structure and activity relationship. Bioorg Med Chem Lett22:6108-15 (2012) 
 
Sodium channel protein type 9 subunit alpha
Name:Sodium channel protein type 9 subunit alpha
Type:Protein
Mol. Mass.:226375.97
Organism:Homo sapiens (Human)
Description:Q15858
Residue:1988
BDBM50391495
NameBDBM50391495
Synonyms:CHEMBL2147220
TypeSmall organic molecule
Emp. Form.C23H24F3N5O
Mol. Mass.443.4648
SMILESCc1ncc(cn1)-c1ccccc1CCNC(=O)c1ccc(CNCCC(F)(F)F)nc1