Reaction Details
TargetSodium channel protein type 5 subunit alpha
LigandBDBM50391483
Substrate/Competitorn/a
Meas. Tech.ChEMBL_849457 (CHEMBL2149458)
IC50 5012±n/a nM
Citation Kers, IMacsari, ICsjernyik, GNylöf, MSkogholm, KSandberg, LMinidis, ABueters, TMalmborg, JEriksson, ABLund, PEVenyike, ELuo, LNyström, JEBesidski, Y Phenethyl nicotinamides, a novel class of Na(V)1.7 channel blockers: structure and activity relationship. Bioorg Med Chem Lett22:6108-15 (2012) 
 
Sodium channel protein type 5 subunit alpha
Name:Sodium channel protein type 5 subunit alpha
Type:Enzyme
Mol. Mass.:226908.60
Organism:Homo sapiens (Human)
Description:Q14524
Residue:2016
BDBM50391483
NameBDBM50391483
Synonyms:CHEMBL2147223
TypeSmall organic molecule
Emp. Form.C22H20ClF3N4O3
Mol. Mass.480.867
SMILESCOc1ncc(cn1)-c1cccc(Cl)c1CCNC(=O)c1ccc(OCCC(F)(F)F)nc1