Reaction Details
TargetSodium channel protein type 5 subunit alpha
LigandBDBM50391506
Substrate/Competitorn/a
Meas. Tech.ChEMBL_849457 (CHEMBL2149458)
IC50 10000±n/a nM
Citation Kers, IMacsari, ICsjernyik, GNylöf, MSkogholm, KSandberg, LMinidis, ABueters, TMalmborg, JEriksson, ABLund, PEVenyike, ELuo, LNyström, JEBesidski, Y Phenethyl nicotinamides, a novel class of Na(V)1.7 channel blockers: structure and activity relationship. Bioorg Med Chem Lett22:6108-15 (2012) 
 
Sodium channel protein type 5 subunit alpha
Name:Sodium channel protein type 5 subunit alpha
Type:Enzyme
Mol. Mass.:226908.60
Organism:Homo sapiens (Human)
Description:Q14524
Residue:2016
BDBM50391506
NameBDBM50391506
Synonyms:CHEMBL2147317
TypeSmall organic molecule
Emp. Form.C22H18F6N4O3
Mol. Mass.500.3937
SMILESCOc1cnc(cn1)-c1cccc(F)c1C(F)(F)CNC(=O)c1ccc(COCC(F)(F)F)nc1