Reaction Details
TargetHistamine H1 receptor
LigandBDBM50391701
Substrate/Competitorn/a
Meas. Tech.ChEMBL_848010 (CHEMBL2150561)
Ki 1±n/a nM
Citation Procopiou, PABrowning, CGore, PMLynn, SMRichards, SASlack, RJSollis, SL Synthesis and pharmacological investigation of azaphthalazinone human histamine H(1) receptor antagonists. Bioorg Med Chem20:6097-108 (2012) 
 
Histamine H1 receptor
Name:Histamine H1 receptor
Type:G Protein-Coupled Receptor (GPCR)
Mol. Mass.:55808.72
Organism:Homo sapiens (Human)
Description:Cell pellets from SK-N-MC cells transfected with human H1 receptor were used in binding assay.
Residue:487
BDBM50391701
NameBDBM50391701
Synonyms:CHEMBL2146808
TypeSmall organic molecule
Emp. Form.C22H25ClN4O2
Mol. Mass.412.913
SMILESCOCCN1CCC[C@@H]1Cn1nc(Cc2ccc(Cl)cc2)c2cccnc2c1=O