Reaction Details
TargetAlpha-1B adrenergic receptor
LigandBDBM50391696
Substrate/Competitorn/a
Meas. Tech.ChEMBL_848015 (CHEMBL2150566)
Ki 39.81±n/a nM
Citation Procopiou, PABrowning, CGore, PMLynn, SMRichards, SASlack, RJSollis, SL Synthesis and pharmacological investigation of azaphthalazinone human histamine H(1) receptor antagonists. Bioorg Med Chem20:6097-108 (2012) 
 
Alpha-1B adrenergic receptor
Name:Alpha-1B adrenergic receptor
Type:Enzyme
Mol. Mass.:56862.13
Organism:Homo sapiens (Human)
Description:P35368
Residue:520
BDBM50391696
NameBDBM50391696
Synonyms:CHEMBL2146813
TypeSmall organic molecule
Emp. Form.C38H48ClN5O2
Mol. Mass.642.273
SMILESClc1ccc(Cc2nn(C[C@H]3CCCN3CCCCc3ccc(OCCCN4CCCCCC4)cc3)c(=O)c3ccncc23)cc1