Reaction Details
TargetAlpha-1A adrenergic receptor
LigandBDBM50391700
Substrate/Competitorn/a
Meas. Tech.ChEMBL_848012 (CHEMBL2150563)
Ki 100±n/a nM
Citation Procopiou, PABrowning, CGore, PMLynn, SMRichards, SASlack, RJSollis, SL Synthesis and pharmacological investigation of azaphthalazinone human histamine H(1) receptor antagonists. Bioorg Med Chem20:6097-108 (2012) 
 
Alpha-1A adrenergic receptor
Name:Alpha-1A adrenergic receptor
Type:Cell-surface receptors
Mol. Mass.:51511.67
Organism:Homo sapiens (Human)
Description:P35348
Residue:466
BDBM50391700
NameBDBM50391700
Synonyms:CHEMBL2146807
TypeSmall organic molecule
Emp. Form.C23H27ClN4O
Mol. Mass.410.94
SMILESCCCCN1CCC[C@@H]1Cn1nc(Cc2ccc(Cl)cc2)c2cccnc2c1=O