Reaction Details
TargetAlpha-1A adrenergic receptor
LigandBDBM50341448
Substrate/Competitorn/a
Meas. Tech.ChEMBL_848012 (CHEMBL2150563)
Ki 50.12±n/a nM
Citation Procopiou, PABrowning, CGore, PMLynn, SMRichards, SASlack, RJSollis, SL Synthesis and pharmacological investigation of azaphthalazinone human histamine H(1) receptor antagonists. Bioorg Med Chem20:6097-108 (2012) 
 
Alpha-1A adrenergic receptor
Name:Alpha-1A adrenergic receptor
Type:Cell-surface receptors
Mol. Mass.:51511.67
Organism:Homo sapiens (Human)
Description:P35348
Residue:466
BDBM50341448
NameBDBM50341448
Synonyms:4-(4-Chloro-benzyl)-2-(1-methyl-azepan-4-yl)-2H-phthalazin-1-one Astelin CHEMBL639 Optivar US20230414632, Compound II-a | rac-Azelastine
TypeSmall organic molecule
Emp. Form.C22H24ClN3O
Mol. Mass.381.898
SMILESCN1CCCC(CC1)n1nc(Cc2ccc(Cl)cc2)c2ccccc2c1=O