Reaction Details
TargetHistamine H1 receptor
LigandBDBM50391703
Substrate/Competitorn/a
Meas. Tech.ChEMBL_848010 (CHEMBL2150561)
Ki 0.631±n/a nM
Citation Procopiou, PABrowning, CGore, PMLynn, SMRichards, SASlack, RJSollis, SL Synthesis and pharmacological investigation of azaphthalazinone human histamine H(1) receptor antagonists. Bioorg Med Chem20:6097-108 (2012) 
 
Histamine H1 receptor
Name:Histamine H1 receptor
Type:G Protein-Coupled Receptor (GPCR)
Mol. Mass.:55808.72
Organism:Homo sapiens (Human)
Description:Cell pellets from SK-N-MC cells transfected with human H1 receptor were used in binding assay.
Residue:487
BDBM50391703
NameBDBM50391703
Synonyms:CHEMBL2146810
TypeSmall organic molecule
Emp. Form.C23H27ClN4O
Mol. Mass.410.94
SMILESCCCCN1CCC[C@@H]1Cn1nc(Cc2ccc(Cl)cc2)c2ncccc2c1=O