Reaction Details
TargetCytochrome P450 3A4
LigandBDBM50391758
Substrate/Competitorn/a
Meas. Tech.ChEMBL_849684 (CHEMBL2150359)
IC50>35000±n/a nM
Citation Peng, HTalreja, TXin, ZCuervo, JHKumaravel, GHumora, MJXu, LRohde, EGan, LJung, MYShackett, MNChollate, SDunah, AWSnodgrass-Belt, PAArnold, HMTaveras, AGRhodes, KJScannevin, RH Discovery of BIIB042, a Potent, Selective, and Orally Bioavailable ¿-Secretase Modulator. ACS Med Chem Lett2:786-791 (2011) 
 
Cytochrome P450 3A4
Name:Cytochrome P450 3A4
Type:Enzyme
Mol. Mass.:57349.57
Organism:Homo sapiens (Human)
Description:n/a
Residue:503
BDBM50391758
NameBDBM50391758
Synonyms:CHEMBL2146750
TypeSmall organic molecule
Emp. Form.C29H29F4NO2
Mol. Mass.499.5397
SMILESC[C@@H](C(O)=O)c1ccc([C@H](N2CCC(C)CC2)c2ccc(F)cc2)c(c1)-c1ccc(cc1)C(F)(F)F