Reaction Details
TargetMicrosomal triglyceride transfer protein large subunit
LigandBDBM50204367
Substrate/Competitorn/a
Meas. Tech.ChEMBL_849013 (CHEMBL2150039)
IC50 2.7±n/a nM
Citation Robinson, RPBartlett, JABertinato, PBessire, AJCosgrove, JFoley, PMManion, TBMinich, MLRamos, BReese, MRSchmahai, TJSwick, AGTess, DAVaz, AWolford, A Discovery of microsomal triglyceride transfer protein (MTP) inhibitors with potential for decreased active metabolite load compared to dirlotapide. Bioorg Med Chem Lett21:4150-4 (2011) 
 
Microsomal triglyceride transfer protein large subunit
Name:Microsomal triglyceride transfer protein large subunit
Type:PROTEIN
Mol. Mass.:99365.65
Organism:Homo sapiens (Human)
Description:ChEMBL_971724
Residue:894
BDBM50204367
NameBDBM50204367
Synonyms:CHEMBL410414 | dirlotapide
TypeSmall organic molecule
Emp. Form.C40H33F3N4O3
Mol. Mass.674.7102
SMILESCN(Cc1ccccc1)C(=O)[C@@H](NC(=O)c1cc2cc(NC(=O)c3ccccc3-c3ccc(cc3)C(F)(F)F)ccc2n1C)c1ccccc1