Reaction Details
TargetMicrosomal triglyceride transfer protein large subunit
LigandBDBM50391856
Substrate/Competitorn/a
Meas. Tech.ChEMBL_849013 (CHEMBL2150039)
IC50 1.8±n/a nM
Citation Robinson, RPBartlett, JABertinato, PBessire, AJCosgrove, JFoley, PMManion, TBMinich, MLRamos, BReese, MRSchmahai, TJSwick, AGTess, DAVaz, AWolford, A Discovery of microsomal triglyceride transfer protein (MTP) inhibitors with potential for decreased active metabolite load compared to dirlotapide. Bioorg Med Chem Lett21:4150-4 (2011) 
 
Microsomal triglyceride transfer protein large subunit
Name:Microsomal triglyceride transfer protein large subunit
Type:PROTEIN
Mol. Mass.:99365.65
Organism:Homo sapiens (Human)
Description:ChEMBL_971724
Residue:894
BDBM50391856
NameBDBM50391856
Synonyms:CHEMBL2147279
TypeSmall organic molecule
Emp. Form.C33H27F3N4O3
Mol. Mass.584.5877
SMILESCNC(=O)[C@@H](NC(=O)c1cc2cc(NC(=O)c3ccccc3-c3ccc(cc3)C(F)(F)F)ccc2n1C)c1ccccc1