Reaction Details
TargetMicrosomal triglyceride transfer protein large subunit
LigandBDBM50391858
Substrate/Competitorn/a
Meas. Tech.ChEMBL_849012 (CHEMBL2150038)
IC50 0.001±n/a nM
Citation Robinson, RPBartlett, JABertinato, PBessire, AJCosgrove, JFoley, PMManion, TBMinich, MLRamos, BReese, MRSchmahai, TJSwick, AGTess, DAVaz, AWolford, A Discovery of microsomal triglyceride transfer protein (MTP) inhibitors with potential for decreased active metabolite load compared to dirlotapide. Bioorg Med Chem Lett21:4150-4 (2011) 
 
Microsomal triglyceride transfer protein large subunit
Name:Microsomal triglyceride transfer protein large subunit
Type:PROTEIN
Mol. Mass.:99365.65
Organism:Homo sapiens (Human)
Description:ChEMBL_971724
Residue:894
BDBM50391858
NameBDBM50391858
Synonyms:CHEMBL2147281
TypeSmall organic molecule
Emp. Form.C40H30F4N4O3
Mol. Mass.690.6848
SMILESCN(Cc1ccc(F)cc1)C(=O)[C@@H](NC(=O)c1ccc2nc(NC(=O)c3ccccc3-c3ccc(cc3)C(F)(F)F)ccc2c1)c1ccccc1