Reaction Details
TargetCathepsin F
LigandBDBM50392213
Substrate/Competitorn/a
Meas. Tech.ChEMBL_852645 (CHEMBL2157194)
Ki>4000±n/a nM
Citation Frizler, MSchmitz, JSchulz-Fincke, ACGütschow, M Selective nitrile inhibitors to modulate the proteolytic synergism of cathepsins S and F. J Med Chem55:5982-6 (2012) 
 
Cathepsin F
Name:Cathepsin F
Type:PROTEIN
Mol. Mass.:53373.38
Organism:Homo sapiens (Human)
Description:ChEMBL_852650
Residue:484
BDBM50392213
NameBDBM50392213
Synonyms:CHEMBL2153166
TypeSmall organic molecule
Emp. Form.C18H21N3O4S3
Mol. Mass.439.572
SMILESCC(C)CS(=O)(=O)CC(NC(=O)c1ccc(s1)-c1ccsc1)C(=O)NCC#N