Reaction Details
TargetHypoxanthine-guanine phosphoribosyltransferase
LigandBDBM50392246
Substrate/Competitorn/a
Meas. Tech.ChEMBL_850551 (CHEMBL2157773)
Ki 40000±n/a nM
Citation Hocková, DKeough, DTJaneba, ZWang, THde Jersey, JGuddat, LW Synthesis of novel N-branched acyclic nucleoside phosphonates as potent and selective inhibitors of human, Plasmodium falciparum and Plasmodium vivax 6-oxopurine phosphoribosyltransferases. J Med Chem55:6209-23 (2012) 
 
Hypoxanthine-guanine phosphoribosyltransferase
Name:Hypoxanthine-guanine phosphoribosyltransferase
Type:Protein
Mol. Mass.:24579.61
Organism:Homo sapiens (Human)
Description:P00492
Residue:218
BDBM50392246
NameBDBM50392246
Synonyms:CHEMBL2153499
TypeSmall organic molecule
Emp. Form.C9H14N5O4P
Mol. Mass.287.2123
SMILESOP(O)(=O)CCNCCn1cnc2c1nc[nH]c2=O