Reaction Details
TargetHypoxanthine-guanine phosphoribosyltransferase
LigandBDBM50392259
Substrate/Competitorn/a
Meas. Tech.ChEMBL_850551 (CHEMBL2157773)
Ki 500±n/a nM
Citation Hocková, DKeough, DTJaneba, ZWang, THde Jersey, JGuddat, LW Synthesis of novel N-branched acyclic nucleoside phosphonates as potent and selective inhibitors of human, Plasmodium falciparum and Plasmodium vivax 6-oxopurine phosphoribosyltransferases. J Med Chem55:6209-23 (2012) 
 
Hypoxanthine-guanine phosphoribosyltransferase
Name:Hypoxanthine-guanine phosphoribosyltransferase
Type:Protein
Mol. Mass.:24579.61
Organism:Homo sapiens (Human)
Description:P00492
Residue:218
BDBM50392259
NameBDBM50392259
Synonyms:CHEMBL2153477
TypeSmall organic molecule
Emp. Form.C13H21N6O6P
Mol. Mass.388.3162
SMILESCOC(=O)CCN(CCn1cnc2c1nc(N)[nH]c2=O)CCP(O)(O)=O