Reaction Details
TargetHypoxanthine-guanine phosphoribosyltransferase
LigandBDBM50392261
Substrate/Competitorn/a
Meas. Tech.ChEMBL_850551 (CHEMBL2157773)
Ki 70±n/a nM
Citation Hocková, DKeough, DTJaneba, ZWang, THde Jersey, JGuddat, LW Synthesis of novel N-branched acyclic nucleoside phosphonates as potent and selective inhibitors of human, Plasmodium falciparum and Plasmodium vivax 6-oxopurine phosphoribosyltransferases. J Med Chem55:6209-23 (2012) 
 
Hypoxanthine-guanine phosphoribosyltransferase
Name:Hypoxanthine-guanine phosphoribosyltransferase
Type:Protein
Mol. Mass.:24579.61
Organism:Homo sapiens (Human)
Description:P00492
Residue:218
BDBM50392261
NameBDBM50392261
Synonyms:CHEMBL2153480
TypeSmall organic molecule
Emp. Form.C12H18N7O4P
Mol. Mass.355.2896
SMILESNc1nc2n(CCN(CCC#N)CCP(O)(O)=O)cnc2c(=O)[nH]1