Reaction Details
TargetPhosphatidylinositol 4,5-bisphosphate 3-kinase catalytic subunit beta isoform
LigandBDBM50392452
Substrate/Competitorn/a
Meas. Tech.ChEMBL_851912 (CHEMBL2156789)
IC50 15±n/a nM
Citation Certal, VHalley, FVirone-Oddos, AThompson, FFiloche-Rommé, BEl-Ahmad, YCarry, JCDelorme, CKarlsson, AAbecassis, PYVincent, LBonnevaux, HNicolas, JPMorales, RMichot, NVade, ILouboutin, APerron, SDoerflinger, GTric, BMonget, SLengauer, CSchio, L Preparation and optimization of new 4-(morpholin-4-yl)-(6-oxo-1,6-dihydropyrimidin-2-yl)amide derivatives as PI3Kß inhibitors. Bioorg Med Chem Lett22:6381-4 (2012) 
 
Phosphatidylinositol 4,5-bisphosphate 3-kinase catalytic subunit beta isoform
Name:Phosphatidylinositol 4,5-bisphosphate 3-kinase catalytic subunit beta isoform
Type:Enzyme Subunit
Mol. Mass.:122769.00
Organism:Homo sapiens (Human)
Description:P42338
Residue:1070
BDBM50392452
NameBDBM50392452
Synonyms:CHEMBL2151922
TypeSmall organic molecule
Emp. Form.C17H20N4O4
Mol. Mass.344.3651
SMILESCOc1cccc(NC(=O)Cc2nc(cc(=O)[nH]2)N2CCOCC2)c1