Reaction Details
TargetCholinesterase
LigandBDBM50392585
Substrate/Competitorn/a
Meas. Tech.ChEMBL_854441 (CHEMBL2154899)
IC50 4000±n/a nM
Citation Catto, MBerezin, AALo Re, DLoizou, GDemetriades, MDe Stradis, ACampagna, FKoutentis, PACarotti, A Design, synthesis and biological evaluation of benzo[e][1,2,4]triazin-7(1H)-one and [1,2,4]-triazino[5,6,1-jk]carbazol-6-one derivatives as dual inhibitors of beta-amyloid aggregation and acetyl/butyryl cholinesterase. Eur J Med Chem58:84-97 (2012) 
 
Cholinesterase
Name:Cholinesterase
Type:Enzyme
Mol. Mass.:65643.35
Organism:Equus caballus (Horse)
Description:P81908
Residue:574
BDBM50392585
NameBDBM50392585
Synonyms:CHEMBL2153030
TypeSmall organic molecule
Emp. Form.C25H25N5O
Mol. Mass.411.4989
SMILESCN(C)CCCN(C)c1cc2nc(nn3c4ccccc4c(c23)c1=O)-c1ccccc1