Reaction Details
TargetCannabinoid receptor 1
LigandBDBM50392705
Substrate/Competitorn/a
Meas. Tech.ChEMBL_854280 (CHEMBL2154446)
Ki>3000±n/a nM
Citation Gembus, VFurman, CMillet, RMansouri, RChavatte, PLevacher, VBrière, JF Scaffold hopping strategy toward original pyrazolines as selective CB2 receptor ligands. Eur J Med Chem58:396-404 (2012) 
 
Cannabinoid receptor 1
Name:Cannabinoid receptor 1
Type:G Protein-Coupled Receptor (GPCR)
Mol. Mass.:52868.96
Organism:Homo sapiens (Human)
Description:P21554
Residue:472
BDBM50392705
NameBDBM50392705
Synonyms:CHEMBL2151374
TypeSmall organic molecule
Emp. Form.C24H29N3O
Mol. Mass.375.5066
SMILESCc1cccc(c1)C1=NN(CC1Cc1ccccc1)C(=O)NC1CCCCC1