Reaction Details
TargetCannabinoid receptor 2
LigandBDBM50392708
Substrate/Competitorn/a
Meas. Tech.ChEMBL_854281 (CHEMBL2154447)
Ki 689±n/a nM
Citation Gembus, VFurman, CMillet, RMansouri, RChavatte, PLevacher, VBrière, JF Scaffold hopping strategy toward original pyrazolines as selective CB2 receptor ligands. Eur J Med Chem58:396-404 (2012) 
 
Cannabinoid receptor 2
Name:Cannabinoid receptor 2
Type:G Protein-Coupled Receptor (GPCR)
Mol. Mass.:39690.94
Organism:Homo sapiens (Human)
Description:P34972
Residue:360
BDBM50392708
NameBDBM50392708
Synonyms:CHEMBL2151377
TypeSmall organic molecule
Emp. Form.C28H34ClN3O
Mol. Mass.464.042
SMILESCc1cc(ccc1Cl)C1=NN(CC1Cc1ccccc1)C(=O)NC1C(C)(C)C2CCC1(C)C2