Reaction Details
TargetCannabinoid receptor 2
LigandBDBM50392711
Substrate/Competitorn/a
Meas. Tech.ChEMBL_854283 (CHEMBL2154449)
EC50 191±n/a nM
Citation Gembus, VFurman, CMillet, RMansouri, RChavatte, PLevacher, VBrière, JF Scaffold hopping strategy toward original pyrazolines as selective CB2 receptor ligands. Eur J Med Chem58:396-404 (2012) 
 
Cannabinoid receptor 2
Name:Cannabinoid receptor 2
Type:G Protein-Coupled Receptor (GPCR)
Mol. Mass.:39690.94
Organism:Homo sapiens (Human)
Description:P34972
Residue:360
BDBM50392711
NameBDBM50392711
Synonyms:CHEMBL2151380
TypeSmall organic molecule
Emp. Form.C29H36ClN3O
Mol. Mass.478.069
SMILESCc1ccc(CC2CN(N=C2c2ccc(Cl)c(C)c2)C(=O)NC2C(C)(C)C3CCC2(C)C3)cc1