Reaction Details
TargetMu-type opioid receptor
LigandBDBM50370067
Substrate/Competitorn/a
Meas. Tech.ChEMBL_853294 (CHEMBL2155054)
Ki 16.6±n/a nM
Citation Harvey, JHLong, DHEngland, PMWhistler, JL Tuned-Affinity Bivalent Ligands for the Characterization of Opioid Receptor Heteromers. ACS Med Chem Lett3:640-644 (2012) 
 
Mu-type opioid receptor
Name:Mu-type opioid receptor
Type:Enzyme Catalytic Domain
Mol. Mass.:44431.62
Organism:MOUSE
Description:OPIATE Mu OPRM1 MOUSE::P42866
Residue:398
BDBM50370067
NameBDBM50370067
Synonyms:CHEMBL1237164
TypeSmall organic molecule
Emp. Form.C26H26N2O3
Mol. Mass.414.4962
SMILESOc1ccc2C[C@H]3N(CC4CC4)CC[C@@]45[C@@H](Oc1c24)c1[nH]c2ccccc2c1C[C@@]35O