Reaction Details
TargetMu-type opioid receptor
LigandBDBM50392800
Substrate/Competitorn/a
Meas. Tech.ChEMBL_853294 (CHEMBL2155054)
Ki 549.54±n/a nM
Citation Harvey, JHLong, DHEngland, PMWhistler, JL Tuned-Affinity Bivalent Ligands for the Characterization of Opioid Receptor Heteromers. ACS Med Chem Lett3:640-644 (2012) 
 
Mu-type opioid receptor
Name:Mu-type opioid receptor
Type:Enzyme Catalytic Domain
Mol. Mass.:44431.62
Organism:MOUSE
Description:OPIATE Mu OPRM1 MOUSE::P42866
Residue:398
BDBM50392800
NameBDBM50392800
Synonyms:CHEMBL2151246
TypeSmall organic molecule
Emp. Form.C39H56N6O7
Mol. Mass.720.8979
SMILES[#6]-[#6]-[#7](-[#6]-[#6])-[#6](=O)-c1ccc(cc1)-[#6](=[#6]-1\[#6]-[#6]-[#7]-[#6]-[#6]-1)\c1c(-[#6])cc(-[#7]-[#6](=O)-[#6]-[#8]-[#6]-[#6](=O)-[#7]-[#6]-[#6]-[#6]-[#6]-[#6]-[#7]-[#6](=O)-[#6]-[#8]-[#6]-[#6](=O)-[#7]-[#6])cc1-[#6]