Reaction Details
TargetMitogen-activated protein kinase 1
LigandBDBM50392851
Substrate/Competitorn/a
Meas. Tech.ChEMBL_853360 (CHEMBL2155150)
IC50 4600±n/a nM
Citation Kaoud, TSYan, CMitra, STseng, CCJose, JTaliaferro, JMTuohetahuntila, MDevkota, ASammons, RPark, JPark, HShi, YHong, JRen, PDalby, KN From in Silico Discovery to intra-Cellular Activity: Targeting JNK-Protein Interactions with Small Molecules. ACS Med Chem Lett3:721-725 (2012) 
 
Mitogen-activated protein kinase 1
Name:Mitogen-activated protein kinase 1
Type:Enzyme
Mol. Mass.:41278.65
Organism:Rattus norvegicus (rat)
Description:MAP Kinase is the rat ERK-2 isoform containing a polyhistidine tag at the N-terminus produced in E.coli. and activated by phosphorylation with MEK1 prior to purification.
Residue:358
BDBM50392851
NameBDBM50392851
Synonyms:CHEMBL2151192
TypeSmall organic molecule
Emp. Form.C13H13BrN10
Mol. Mass.389.213
SMILESNc1[nH]n2c(nc(N)c3c(N)nnc23)c1NNc1ccc(Br)cc1