Reaction Details
TargetMitogen-activated protein kinase 1
LigandBDBM50392852
Substrate/Competitorn/a
Meas. Tech.ChEMBL_853360 (CHEMBL2155150)
IC50 7500±n/a nM
Citation Kaoud, TSYan, CMitra, STseng, CCJose, JTaliaferro, JMTuohetahuntila, MDevkota, ASammons, RPark, JPark, HShi, YHong, JRen, PDalby, KN From in Silico Discovery to intra-Cellular Activity: Targeting JNK-Protein Interactions with Small Molecules. ACS Med Chem Lett3:721-725 (2012) 
 
Mitogen-activated protein kinase 1
Name:Mitogen-activated protein kinase 1
Type:Enzyme
Mol. Mass.:41278.65
Organism:Rattus norvegicus (rat)
Description:MAP Kinase is the rat ERK-2 isoform containing a polyhistidine tag at the N-terminus produced in E.coli. and activated by phosphorylation with MEK1 prior to purification.
Residue:358
BDBM50392852
NameBDBM50392852
Synonyms:CHEMBL2151193
TypeSmall organic molecule
Emp. Form.C19H13N3OS
Mol. Mass.331.391
SMILESCOc1ccc(cc1)-c1nnc2sc3c(ccc4ccccc34)n12