Reaction Details
TargetMitogen-activated protein kinase 1
LigandBDBM50392849
Substrate/Competitorn/a
Meas. Tech.ChEMBL_853362 (CHEMBL2155182)
IC50 1000±n/a nM
Citation Kaoud, TSYan, CMitra, STseng, CCJose, JTaliaferro, JMTuohetahuntila, MDevkota, ASammons, RPark, JPark, HShi, YHong, JRen, PDalby, KN From in Silico Discovery to intra-Cellular Activity: Targeting JNK-Protein Interactions with Small Molecules. ACS Med Chem Lett3:721-725 (2012) 
 
Mitogen-activated protein kinase 1
Name:Mitogen-activated protein kinase 1
Type:Enzyme
Mol. Mass.:41278.65
Organism:Rattus norvegicus (rat)
Description:MAP Kinase is the rat ERK-2 isoform containing a polyhistidine tag at the N-terminus produced in E.coli. and activated by phosphorylation with MEK1 prior to purification.
Residue:358
BDBM50392849
NameBDBM50392849
Synonyms:CHEMBL2151190 | US9073941, 612
TypeSmall organic molecule
Emp. Form.C14H11N5O4
Mol. Mass.313.2682
SMILESCn1nc(nc2c1nc(=O)n(C)c2=O)-c1ccc2OCOc2c1