Reaction Details
TargetMitogen-activated protein kinase 9
LigandBDBM50392853
Substrate/Competitorn/a
Meas. Tech.ChEMBL_853353 (CHEMBL2155143)
IC50 43000±n/a nM
Citation Kaoud, TSYan, CMitra, STseng, CCJose, JTaliaferro, JMTuohetahuntila, MDevkota, ASammons, RPark, JPark, HShi, YHong, JRen, PDalby, KN From in Silico Discovery to intra-Cellular Activity: Targeting JNK-Protein Interactions with Small Molecules. ACS Med Chem Lett3:721-725 (2012) 
 
Mitogen-activated protein kinase 9
Name:Mitogen-activated protein kinase 9
Type:Enzyme
Mol. Mass.:48131.49
Organism:Homo sapiens (Human)
Description:JNK-2 was purchased from Upstate Cell Signaling Solutions (formerly Upstate Biotechnology).
Residue:424
BDBM50392853
NameBDBM50392853
Synonyms:CHEMBL2000337
TypeSmall organic molecule
Emp. Form.C18H14O7
Mol. Mass.342.2996
SMILESOC(=O)C(CC(=O)c1ccc2OCOc2c1)c1ccc2OCOc2c1