Reaction Details
TargetMatrix metalloproteinase-14
LigandBDBM50215927
Substrate/Competitorn/a
Meas. Tech.ChEMBL_853831 (CHEMBL2154857)
IC50 8030±n/a nM
Citation Shengule, SRLoa-Kum-Cheung, WLParish, CRBlairvacq, MMeijer, LNakao, YKaruso, P A one-pot synthesis and biological activity of ageladine A and analogues. J Med Chem54:2492-503 (2011) 
 
Matrix metalloproteinase-14
Name:Matrix metalloproteinase-14
Type:Protein
Mol. Mass.:65900.19
Organism:Homo sapiens (Human)
Description:P50281
Residue:582
BDBM50215927
NameBDBM50215927
Synonyms:4-(1H-pyrrol-2-yl)-1H-imidazo[4,5-c]pyridin-2-amine | CHEMBL230194
TypeSmall organic molecule
Emp. Form.C10H9N5
Mol. Mass.199.212
SMILESNc1nc2c(nccc2[nH]1)-c1ccc[nH]1