Reaction Details
TargetCollagenase 3
LigandBDBM50215926
Substrate/Competitorn/a
Meas. Tech.ChEMBL_853828 (CHEMBL2154854)
IC50 1310±n/a nM
Citation Shengule, SRLoa-Kum-Cheung, WLParish, CRBlairvacq, MMeijer, LNakao, YKaruso, P A one-pot synthesis and biological activity of ageladine A and analogues. J Med Chem54:2492-503 (2011) 
 
Collagenase 3
Name:Collagenase 3
Type:Enzyme
Mol. Mass.:53808.06
Organism:Homo sapiens (Human)
Description:P45452
Residue:471
BDBM50215926
NameBDBM50215926
Synonyms:4-(4,5-dibromo-1H-pyrrol-2-yl)-1H-imidazo[4,5-c]pyridin-2-amine CHEMBL230806
TypeSmall organic molecule
Emp. Form.C10H7Br2N5
Mol. Mass.357.004
SMILESNc1nc2c(nccc2[nH]1)-c1cc(Br)c(Br)[nH]1