Reaction Details
TargetDual specificity tyrosine-phosphorylation-regulated kinase 1A
LigandBDBM50393108
Substrate/Competitorn/a
Meas. Tech.ChEMBL_853862 (CHEMBL2154888)
Kd 300±n/a nM
Citation Shengule, SRLoa-Kum-Cheung, WLParish, CRBlairvacq, MMeijer, LNakao, YKaruso, P A one-pot synthesis and biological activity of ageladine A and analogues. J Med Chem54:2492-503 (2011) 
 
Dual specificity tyrosine-phosphorylation-regulated kinase 1A
Name:Dual specificity tyrosine-phosphorylation-regulated kinase 1A
Type:Enzyme
Mol. Mass.:85616.61
Organism:Homo sapiens (Human)
Description:Q13627
Residue:763
BDBM50393108
NameBDBM50393108
Synonyms:CHEMBL2153266
TypeSmall organic molecule
Emp. Form.C15H11N5
Mol. Mass.261.2813
SMILESNc1nc2c(nccc2[nH]1)-c1cnc2ccccc2c1