Reaction Details
TargetMatrix metalloproteinase-9
LigandBDBM50393211
Substrate/Competitorn/a
Meas. Tech.ChEMBL_850717 (CHEMBL2155986)
Ki 10±n/a nM
Citation Mucha, AKafarski, PBerlicki, L Remarkable potential of thea-aminophosphonate/phosphinate structural motif in medicinal chemistry. J Med Chem54:5955-80 (2011) 
 
Matrix metalloproteinase-9
Name:Matrix metalloproteinase-9
Type:Enzyme
Mol. Mass.:78452.28
Organism:Homo sapiens (Human)
Description:P14780
Residue:707
BDBM50393211
NameBDBM50393211
Synonyms:CHEMBL2153737
TypeSmall organic molecule
Emp. Form.C38H41N4O6P
Mol. Mass.680.7291
SMILESNC(=O)[C@H](Cc1c[nH]c2ccccc12)NC(=O)[C@H](CCc1ccccc1)CP(O)(=O)[C@H](Cc1ccccc1)NC(=O)OCc1ccccc1