Reaction Details
TargetHypoxia-inducible factor 1-alpha
LigandBDBM50393296
Substrate/Competitorn/a
Meas. Tech.ChEMBL_851754 (CHEMBL2156222)
EC50 1630±n/a nM
Citation Theriault, JRFelts, ASBates, BSPerez, JRPalmer, MGilbert, SRDawson, ESEngers, JLLindsley, CWEmmitte, KA Discovery of a new molecular probe ML228: an activator of the hypoxia inducible factor (HIF) pathway. Bioorg Med Chem Lett22:76-81 (2011) 
 
Hypoxia-inducible factor 1-alpha
Name:Hypoxia-inducible factor 1-alpha
Type:Protein
Mol. Mass.:92647.24
Organism:Homo sapiens (Human)
Description:Q16665
Residue:826
BDBM50393296
NameBDBM50393296
Synonyms:CHEMBL2144958
TypeSmall organic molecule
Emp. Form.C27H21N5
Mol. Mass.415.4891
SMILESC(Nc1nc(nnc1-c1ccccc1)-c1ccccn1)c1ccc(cc1)-c1ccccc1