Reaction Details
Target5-hydroxytryptamine receptor 1A
LigandBDBM50393392
Substrate/Competitorn/a
Meas. Tech.ChEMBL_855539 (CHEMBL2162844)
Ki 5±n/a nM
Citation Zajdel, PKurczab, RGrychowska, KSatala, GPawlowski, MBojarski, AJ The multiobjective based design, synthesis and evaluation of the arylsulfonamide/amide derivatives of aryloxyethyl- and arylthioethyl- piperidines and pyrrolidines as a novel class of potent 5-HT7 receptor antagonists. Eur J Med Chem56:348-360 (2012) 
 
5-hydroxytryptamine receptor 1A
Name:5-hydroxytryptamine receptor 1A
Type:n/a
Mol. Mass.:46122.49
Organism:Homo sapiens (Human)
Description:n/a
Residue:422
BDBM50393392
NameBDBM50393392
Synonyms:CHEMBL2159486
TypeSmall organic molecule
Emp. Form.C19H23ClN2O3S2
Mol. Mass.426.981
SMILESCSc1ccccc1OCCN1CCC(C1)NS(=O)(=O)c1cccc(Cl)c1