Reaction Details
Target5-hydroxytryptamine receptor 7
LigandBDBM50393391
Substrate/Competitorn/a
Meas. Tech.ChEMBL_855538 (CHEMBL2162843)
Ki 4±n/a nM
Citation Zajdel, PKurczab, RGrychowska, KSatala, GPawlowski, MBojarski, AJ The multiobjective based design, synthesis and evaluation of the arylsulfonamide/amide derivatives of aryloxyethyl- and arylthioethyl- piperidines and pyrrolidines as a novel class of potent 5-HT7 receptor antagonists. Eur J Med Chem56:348-360 (2012) 
 
5-hydroxytryptamine receptor 7
Name:5-hydroxytryptamine receptor 7
Type:G Protein-Coupled Receptor (GPCR)
Mol. Mass.:53573.08
Organism:Homo sapiens (Human)
Description:P34969
Residue:479
BDBM50393391
NameBDBM50393391
Synonyms:CHEMBL2159485
TypeSmall organic molecule
Emp. Form.C21H27ClN2O3S
Mol. Mass.422.969
SMILESCC(C)c1ccccc1OCCN1CCC(C1)NS(=O)(=O)c1cccc(Cl)c1