Reaction Details
TargetALK tyrosine kinase receptor/Nucleophosmin
LigandBDBM50393625
Substrate/Competitorn/a
Meas. Tech.ChEMBL_855440 (CHEMBL2162287)
IC50 200±n/a nM
Citation Mesaros, EFThieu, TVWells, GJZificsak, CAWagner, JCBreslin, HJTripathy, RDiebold, JLMcHugh, RJWohler, ATQuail, MRWan, WLu, LHuang, ZAlbom, MSAngeles, TSWells-Knecht, KJAimone, LDCheng, MAtor, MAOtt, GRDorsey, BD Strategies to mitigate the bioactivation of 2-anilino-7-aryl-pyrrolo[2,1-f][1,2,4]triazines: identification of orally bioavailable, efficacious ALK inhibitors. J Med Chem55:115-25 (2012) 
 
ALK tyrosine kinase receptor/Nucleophosmin
Name:ALK tyrosine kinase receptor/Nucleophosmin
Synonyms:NPM/ALK (Nucleophosmin/ALK tyrosine kinase receptor)
Type:n/a
Mol. Mass.:n/a
Description:ASSAY_ID of EBI is 331455
Components:This complex has 2 components.
Component 1
Name:ALK tyrosine kinase receptor
Type:Protein
Mol. Mass.:176453.10
Organism:Homo sapiens (Human)
Description:Q9UM73
Residue:1620
Component 2
Name:Nucleophosmin
Synonyms:NPM NPM1 | NPM_HUMAN
Type:PROTEIN
Mol. Mass.:32552.99
Organism:Homo sapiens (Human)
Description:ChEMBL_1502715
Residue:294
Component 3
Name:ALK tyrosine kinase receptor
Synonyms:ALK ALK_HUMAN CD_antigen: CD246
Type:Protein
Mol. Mass.:176453.10
Organism:Homo sapiens (Human)
Description:Q9UM73
Residue:1620
BDBM50393625
NameBDBM50393625
Synonyms:CHEMBL2158521
TypeSmall organic molecule
Emp. Form.C28H34FN7O4S
Mol. Mass.583.677
SMILESCOc1cc(N2CCN(C[C@H](C)O)CC2)c(F)cc1Nc1ncc2ccc(-c3ccccc3N(C)S(C)(=O)=O)n2n1