Reaction Details
TargetMu-type opioid receptor
LigandBDBM50393705
Substrate/Competitorn/a
Meas. Tech.ChEMBL_856460 (CHEMBL2161363)
IC50 590±n/a nM
Citation Varamini, PMansfeld, FMBlanchfield, JTWyse, BDSmith, MTToth, I Synthesis and biological evaluation of an orally active glycosylated endomorphin-1. J Med Chem55:5859-67 (2012) 
 
Mu-type opioid receptor
Name:Mu-type opioid receptor
Type:G Protein-Coupled Receptor (GPCR)
Mol. Mass.:44789.51
Organism:Homo sapiens (Human)
Description:P35372
Residue:400
BDBM50393705
NameBDBM50393705
Synonyms:CHEMBL2158990
TypeSmall organic molecule
Emp. Form.C50H63N7O17
Mol. Mass.1034.0719
SMILESNC(=O)[C@H](Cc1ccccc1)NC(=O)[C@H](Cc1c[nH]c2ccccc12)NC(=O)[C@@H]1CCCN1C(=O)[C@H](Cc1ccc(O)cc1)NC(=O)CCC(=O)N[C@@H]1O[C@H](CO)[C@@H](O[C@@H]2O[C@H](CO)[C@H](O)[C@H](O)[C@H]2O)[C@H](O)[C@H]1O