Reaction Details
TargetQuinolone resistance protein NorA
LigandBDBM50393706
Substrate/Competitorn/a
Meas. Tech.ChEMBL_856643 (CHEMBL2162180)
IC50 7700±n/a nM
Citation Holler, JGSlotved, HCMølgaard, POlsen, CEChristensen, SB Chalcone inhibitors of the NorA efflux pump in Staphylococcus aureus whole cells and enriched everted membrane vesicles. Bioorg Med Chem20:4514-21 (2012) 
 
Quinolone resistance protein NorA
Name:Quinolone resistance protein NorA
Type:PROTEIN
Mol. Mass.:42273.03
Organism:Staphylococcus aureus
Description:ChEMBL_961221
Residue:388
BDBM50393706
NameBDBM50393706
Synonyms:CHEMBL2158999
TypeSmall organic molecule
Emp. Form.C21H26N2O2
Mol. Mass.338.4433
SMILESCN(C)CCOc1ccc(cc1)C(=O)\C=C\c1ccc(cc1)N(C)C